Search found 2347 matches

by studio32
Sun Apr 13, 2014 6:09 pm
Forum: Linux Music News
Topic: Ann: Radium 1.9.37
Replies: 58
Views: 23557

Re: Ann: Radium 1.9.37

AFAIK I did everything in the README bfluidsynth.a -lsndfile -lsamplerate -lglib-2.0 -Wl,-Bstatic -lbfd -Wl,-Bdynamic -lz -liberty -ldl SoundPluginRegistry.o: In function `PR_init_plugin_types': /home/derick/localpackage/git/radium/audio/SoundPluginRegistry.cpp:278: undefined reference to `create_fa...
by studio32
Sun Apr 13, 2014 11:46 am
Forum: Linux Music News
Topic: Ann: Radium 1.9.37
Replies: 58
Views: 23557

Re: Ann: Radium 1.9.37

Maybe you can make it possible to add an option to build without PD. edit: Ok, I think I reached my limit to get this thing working ;) SoundPluginRegistry.o: In function `PR_init_plugin_types': /home/derick/localpackage/git/radium/audio/SoundPluginRegistry.cpp:278: undefined reference to `create_fau...
by studio32
Sun Apr 13, 2014 11:30 am
Forum: Linux Music News
Topic: Ann: Radium 1.9.37
Replies: 58
Views: 23557

Re: Ann: Radium 1.9.37

cd Qt/ && ./create_source_from_ui.sh uic moc mixer_widget gcc -c `cat buildtype.opt` -DNOPAUSEPLAY -DCOMPILING_RADIUM -Ibin/packages/gc-7.2/include -IQt/ -I/usr/include/python2.7 -DGUIISQT -Imidi/rtmidi -DUSE_GFX_OP_QUEUE -I/usr/include/libiberty -Werror=array-bounds -msse -mfpmath=sse -DFO...
by studio32
Sun Apr 13, 2014 11:12 am
Forum: Linux Music News
Topic: Ann: Radium 1.9.37
Replies: 58
Views: 23557

Re: Ann: Radium 1.9.37

hm gcc -c `cat buildtype.opt` -DNOPAUSEPLAY -DCOMPILING_RADIUM -Ibin/packages/gc-7.2/include -IQt/ -I/usr/include/python2.7 -DGUIISQT -Imidi/rtmidi -DUSE_GFX_OP_QUEUE -I/usr/include/libiberty -Werror=array-bounds -msse -mfpmath=sse -DFOR_LINUX -DUSE_QT_VISUAL=1 -DUSE_GTK_VISUAL=0 -DUSE_QT_REQTYPE=1 ...
by studio32
Sun Apr 13, 2014 11:09 am
Forum: Linux Music News
Topic: Ann: Radium 1.9.37
Replies: 58
Views: 23557

Re: Ann: Radium 1.9.37

I've this:


#export OS_OPTS="-DTEST_GC"
export OS_OPTS="-Werror=array-bounds -msse -mfpmath=sse -DFOR_LINUX
#-DWITH_PD"
#export OS_OPTS="-Werror=array-bounds -march=native"

Edit: oh I do miss a "
by studio32
Sun Apr 13, 2014 10:35 am
Forum: Linux Music News
Topic: Ann: Radium 1.9.37
Replies: 58
Views: 23557

Re: Ann: Radium 1.9.37

In file included from common/vector.c:19:0: common/nsmtracker.h:376:49: error: unknown type name ‘ReqType’ int (*getPatch)(struct Tracker_Windows *window,ReqType reqtype,struct Tracks *track,struct Patch *patch); ^ make: *** [window_config.o] Error 1 make: *** [vector.o] Error 1 In file included fr...
by studio32
Sun Apr 13, 2014 9:39 am
Forum: Linux Music News
Topic: Ann: Radium 1.9.37
Replies: 58
Views: 23557

Re: Ann: Radium 1.9.37

Is it possible to build without PD?
by studio32
Sun Apr 13, 2014 9:21 am
Forum: Linux Music News
Topic: Ann: Radium 1.9.37
Replies: 58
Views: 23557

Re: Ann: Radium 1.9.37

2gb externalobjs/k_cext_unix.c.o: In function `k_sys_mktempfilename': /home/derick/localpackage/git/radium/bin/packages/libpd-master/externals/k_cext/k_cext_unix.c:48: warning: the use of `mktemp' is dangerous, better use `mkstemp' or `mkdtemp' bash -c "if ! libpds/bin2c libs/libpd.so >libpds/l...
by studio32
Sun Apr 13, 2014 8:53 am
Forum: Linux Music News
Topic: Ann: Radium 1.9.37
Replies: 58
Views: 23557

Re: Ann: Radium 1.9.37

yep git here Sitar\" -DCREATE_NAME=create_stk_sitar_plugin -Iaudio/faust-examples/faust-stk Packages not build. First run 'make packages' make: *** [dependencies_ok] Error 5 make: *** Waiting for unfinished jobs.... /radium/bin/packages/libpd-master/externals/k_cext/k_cext_unix.c:48: warning: t...
by studio32
Sun Apr 13, 2014 8:16 am
Forum: Linux Music News
Topic: Ann: Radium 1.9.37
Replies: 58
Views: 23557

Re: Ann: Radium 1.9.37

p -DDSP_NAME=\"STK\ Glass\ Harmonica\" -DCREATE_NAME=create_stk_glass_harmonica_plugin -Iaudio/faust-examples/faust-stk check_dependencies.sh: line 150: syntax error: unexpected end of file make: *** [dependencies_ok] Error 2 make: *** Waiting for unfinished jobs.... ]
by studio32
Sun Apr 13, 2014 8:11 am
Forum: Linux Music News
Topic: Ann: Radium 1.9.37
Replies: 58
Views: 23557

Re: Ann: Radium 1.9.37

/usr/include/libiberty/libiberty.h:655:14: error: storage class specified for parameter ‘C_alloca’ extern void *C_alloca (size_t) ATTRIBUTE_MALLOC; ^ temp4528.c:6:1: error: expected declaration specifiers before ‘main’ main(){return 0;} ^ In file included from temp4528.c:5:0: /usr/include/libiberty...
by studio32
Sun Apr 13, 2014 7:57 am
Forum: Linux Music News
Topic: Ann: Radium 1.9.37
Replies: 58
Views: 23557

Re: Ann: Radium 1.9.37

In file included from crashreporter/backtrace-symbols.c:58:0, from crashreporter/crashreporter_posix.c:22: /usr/include/libiberty/libiberty.h:110:14: error: old-style parameter declarations in prototyped function definition extern char *basename (const char *) ATTRIBUTE_RETURNS_NONNULL ATTRIBUTE_NO...
by studio32
Sat Apr 12, 2014 11:24 pm
Forum: Linux Music News
Topic: Ann: Radium 1.9.37
Replies: 58
Views: 23557

Re: Ann: Radium 1.9.37

Yes I tried that myself already, but that doesn't fix it as you saw in my error message
by studio32
Sat Apr 12, 2014 9:02 pm
Forum: Linux Music News
Topic: Ann: Radium 1.9.37
Replies: 58
Views: 23557

Re: Ann: Radium 1.9.37

did both, and having that build error
by studio32
Sat Apr 12, 2014 6:25 pm
Forum: Linux Music News
Topic: Ann: Radium 1.9.37
Replies: 58
Views: 23557

Re: Ann: Radium 1.9.37

It doesn't build on Debian testing, all though I've all dependencies installed AFAIK: emp6040.c:5:23: fatal error: libiberty.h: No such file or directory #include <libiberty.h> ^ compilation terminated. Couldn't find -lbfd or -ldl, or header files for bfd, dlfcn or libiberty. On Fedora, binutils-dev...

Go to advanced search